注册 登录  
 加关注
查看详情
   显示下一条  |  关闭
温馨提示!由于新浪微博认证机制调整,您的新浪微博帐号绑定已过期,请重新绑定!立即重新绑定新浪微博》  |  关闭

linux 学习

 
 
 

日志

 
 

qvfb的时候出现错误X11/extensions/XTest.h: 没有那个文件或目录  

2011-10-02 20:19:36|  分类: QT编程 |  标签: |举报 |字号 订阅

  下载LOFTER 我的照片书  |
译x86 的qvfb的时候出现错误
x11keyfaker.cpp:47:34: error: X11/extensions/XTest.h: 没有那个文件或目录
x11keyfaker.cpp: In member function ‘void X11KeyFaker::sendKeyEvent(int, bool)’:
x11keyfaker.cpp:448: error: ‘XTestFakeKeyEvent’ was not declared in this scope
x11keyfaker.cpp:451: error: ‘XTestFakeKeyEvent’ was not declared in this scope
x11keyfaker.cpp:455: error: ‘XTestFakeKeyEvent’ was not declared in this scope
x11keyfaker.cpp:458: error: ‘XTestFakeKeyEvent’ was not declared in this scope
x11keyfaker.cpp:463: error: ‘XTestFakeKeyEvent’ was not declared in this scope
x11keyfaker.cpp: In member function ‘void X11KeyFaker::connect()’:
x11keyfaker.cpp:549: error: ‘XTestQueryExtension’ was not declared in this scope
make: *** [.obj/release-shared/x11keyfaker.o] 错误 1
解决办法:sudo apt-get install xorg-dev
  评论这张
 
阅读(3136)| 评论(0)
推荐 转载

历史上的今天

在LOFTER的更多文章

评论

<#--最新日志,群博日志--> <#--推荐日志--> <#--引用记录--> <#--博主推荐--> <#--随机阅读--> <#--首页推荐--> <#--历史上的今天--> <#--被推荐日志--> <#--上一篇,下一篇--> <#-- 热度 --> <#-- 网易新闻广告 --> <#--右边模块结构--> <#--评论模块结构--> <#--引用模块结构--> <#--博主发起的投票-->
 
 
 
 
 
 
 
 
 
 
 
 
 
 

页脚

网易公司版权所有 ©1997-2018